﻿"Item Id","Item URI","Dublin Core:Title","Dublin Core:Subject","Dublin Core:Description","Dublin Core:Creator","Dublin Core:Source","Dublin Core:Publisher","Dublin Core:Date","Dublin Core:Contributor","Dublin Core:Rights","Dublin Core:Relation","Dublin Core:Format","Dublin Core:Language","Dublin Core:Type","Dublin Core:Identifier","Dublin Core:Coverage","Item Type Metadata:Text","Item Type Metadata:Interviewer","Item Type Metadata:Interviewee","Item Type Metadata:Location","Item Type Metadata:Transcription","Item Type Metadata:Local URL","Item Type Metadata:Original Format","Item Type Metadata:Physical Dimensions","Item Type Metadata:Duration","Item Type Metadata:Compression","Item Type Metadata:Producer","Item Type Metadata:Director","Item Type Metadata:Bit Rate/Frequency","Item Type Metadata:Time Summary","Item Type Metadata:Email Body","Item Type Metadata:Subject Line","Item Type Metadata:From","Item Type Metadata:To","Item Type Metadata:CC","Item Type Metadata:BCC","Item Type Metadata:Number of Attachments","Item Type Metadata:Standards","Item Type Metadata:Objectives","Item Type Metadata:Materials","Item Type Metadata:Lesson Plan Text","Item Type Metadata:URL","Item Type Metadata:Event Type","Item Type Metadata:Participants","Item Type Metadata:Birth Date","Item Type Metadata:Birthplace","Item Type Metadata:Death Date","Item Type Metadata:Occupation","Item Type Metadata:Biographical Text","Item Type Metadata:Bibliography","Item Type Metadata:OHMS Object","Item Type Metadata:OHMS Object Text","Item Type Metadata:Interview Keyword","Item Type Metadata:Interview Format",tags,file,itemType,collection,public,featured
259,http://vtwomenshistory.lib.vt.edu/items/show/259,"<em>Diversity News</em>, Vol. 5 No. 2, Spring 1999 ","Alumni--Women^^Diversity in higher education^^Faculty--Women^^Staff--Women^^University policies","<em>Diversity News</em>, continued <em>Minority Newsletter</em> (LD5655 .A78631 M5)",,,,1999,,"This Item is protected by copyright and/or related rights. You are free to use this Item in any way that is permitted by the copyright and related rights legislation that applies to your use. In addition, no permission is required from the rights-holder(s) for educational uses. For other uses, you need to obtain permission from the rights-holder(s). <a href=""https://rightsstatements.org/page/InC-EDU/1.0/?language=en"" target=""_blank"" rel=""noreferrer noopener"">https://rightsstatements.org/page/InC-EDU/1.0/?language=en</a>",,application/pdf,English,Newsletters,LD_5655_A76831_D58_V5_No2_1999,,,,,,,,,,,,,,,,,,,,,,,,,,,,,,,,,,,,,,,,,http://digitalsc.lib.vt.edu/files/original/797bfb424af55521b8ded7002f6a7535.pdf,Text,"<em>Minority Newsletter and Diversity News</em> (LD_5655_A76831)",1,0
260,http://vtwomenshistory.lib.vt.edu/items/show/260,"<em>Diversity News</em>, Vol. 6 No. 1, Fall 1999 ","Alumni--Women^^Diversity in higher education^^Faculty--Women^^Staff--Women^^University policies","<em>Diversity News</em>, continued <em>Minority Newsletter</em> (LD5655 .A78631 M5)",,,,1999,,"This Item is protected by copyright and/or related rights. You are free to use this Item in any way that is permitted by the copyright and related rights legislation that applies to your use. In addition, no permission is required from the rights-holder(s) for educational uses. For other uses, you need to obtain permission from the rights-holder(s). <a href=""https://rightsstatements.org/page/InC-EDU/1.0/?language=en"" target=""_blank"" rel=""noreferrer noopener"">https://rightsstatements.org/page/InC-EDU/1.0/?language=en</a>",,application/pdf,English,Newsletters,LD_5655_A76831_D58_V6_No1_1999,,,,,,,,,,,,,,,,,,,,,,,,,,,,,,,,,,,,,,,,,http://digitalsc.lib.vt.edu/files/original/c8164ccfce0e9aab85d26097d7bc212b.pdf,Text,"<em>Minority Newsletter and Diversity News</em> (LD_5655_A76831)",1,0
261,http://vtwomenshistory.lib.vt.edu/items/show/261,"<em>Diversity News</em>, Vol. 6 No. 2, Spring 2000","Alumni--Women^^Diversity in higher education^^Faculty--Women^^Staff--Women^^University policies","<em>Diversity News</em>, continued <em>Minority Newsletter</em> (LD5655 .A78631 M5)",,,,2000,,"This Item is protected by copyright and/or related rights. You are free to use this Item in any way that is permitted by the copyright and related rights legislation that applies to your use. In addition, no permission is required from the rights-holder(s) for educational uses. For other uses, you need to obtain permission from the rights-holder(s). <a href=""https://rightsstatements.org/page/InC-EDU/1.0/?language=en"" target=""_blank"" rel=""noreferrer noopener"">https://rightsstatements.org/page/InC-EDU/1.0/?language=en</a>",,application/pdf,English,Newsletters,LD_5655_A76831_D58_V6_No2_2000,,,,,,,,,,,,,,,,,,,,,,,,,,,,,,,,,,,,,,,,,http://digitalsc.lib.vt.edu/files/original/016a915f53859ad766f75b795ef7747e.pdf,Text,"<em>Minority Newsletter and Diversity News</em> (LD_5655_A76831)",1,0
262,http://vtwomenshistory.lib.vt.edu/items/show/262,"<em>Diversity News</em>, Vol. 7 No. 1, Fall 2000 ","Alumni--Women^^Diversity in higher education^^Faculty--Women^^Staff--Women^^University policies","<em>Diversity News</em>, continued <em>Minority Newsletter</em> (LD5655 .A78631 M5)",,,,2000,,"This Item is protected by copyright and/or related rights. You are free to use this Item in any way that is permitted by the copyright and related rights legislation that applies to your use. In addition, no permission is required from the rights-holder(s) for educational uses. For other uses, you need to obtain permission from the rights-holder(s). <a href=""https://rightsstatements.org/page/InC-EDU/1.0/?language=en"" target=""_blank"" rel=""noreferrer noopener"">https://rightsstatements.org/page/InC-EDU/1.0/?language=en</a>",,application/pdf,English,Newsletters,LD_5655_A76831_D58_V7_No1_2000,,,,,,,,,,,,,,,,,,,,,,,,,,,,,,,,,,,,,,,,,http://digitalsc.lib.vt.edu/files/original/541d894f005e9a24923a15f78c86c7d5.pdf,Text,"<em>Minority Newsletter and Diversity News</em> (LD_5655_A76831)",1,0
263,http://vtwomenshistory.lib.vt.edu/items/show/263,"<em>Diversity News</em>, Vol. 7 No. 2, Spring/Summer 2001","Alumni--Women^^Diversity in higher education^^Faculty--Women^^Staff--Women^^University policies","<em>Diversity News</em>, continued <em>Minority Newsletter</em> (LD5655 .A78631 M5)",,,,2001,,"This Item is protected by copyright and/or related rights. You are free to use this Item in any way that is permitted by the copyright and related rights legislation that applies to your use. In addition, no permission is required from the rights-holder(s) for educational uses. For other uses, you need to obtain permission from the rights-holder(s). <a href=""https://rightsstatements.org/page/InC-EDU/1.0/?language=en"" target=""_blank"" rel=""noreferrer noopener"">https://rightsstatements.org/page/InC-EDU/1.0/?language=en</a>",,application/pdf,English,Newsletters,LD_5655_A76831_D58_V7_No2_2001,,,,,,,,,,,,,,,,,,,,,,,,,,,,,,,,,,,,,,,,,http://digitalsc.lib.vt.edu/files/original/1e21852b15b0d6d1d1bdbea603e6cdb2.pdf,Text,"<em>Minority Newsletter and Diversity News</em> (LD_5655_A76831)",1,0
264,http://vtwomenshistory.lib.vt.edu/items/show/264,"<em>Diversity News</em>, Vol. 8 No. 1, Spring/Summer 2002","Alumni--Women^^Diversity in higher education^^Faculty--Women^^Staff--Women^^University policies","<em>Diversity News</em>, continued <em>Minority Newsletter</em> (LD5655 .A78631 M5)",,,,2002,,"This Item is protected by copyright and/or related rights. You are free to use this Item in any way that is permitted by the copyright and related rights legislation that applies to your use. In addition, no permission is required from the rights-holder(s) for educational uses. For other uses, you need to obtain permission from the rights-holder(s). <a href=""https://rightsstatements.org/page/InC-EDU/1.0/?language=en"" target=""_blank"" rel=""noreferrer noopener"">https://rightsstatements.org/page/InC-EDU/1.0/?language=en</a>",,application/pdf,English,Newsletters,LD_5655_A76831_D58_V8_No1_2002,,,,,,,,,,,,,,,,,,,,,,,,,,,,,,,,,,,,,,,,,http://digitalsc.lib.vt.edu/files/original/8d8df7aa95af61247726063530b26882.pdf,Text,"<em>Minority Newsletter and Diversity News</em> (LD_5655_A76831)",1,0
52,http://vtwomenshistory.lib.vt.edu/items/show/52,"<em>Generations of Women Leaders at Virginia Tech: 75th Anniversary of Women at Virginia Tech</em>","Admission of women^^Administrators--Women","This is a 1996 book published for the 75th anniversary of the admission of women to VPI. ","Cox, Clara","<a href=""http://ead.lib.virginia.edu/vivaxtf/view?docId=vt/viblbv00980.xml"">RG 5/1/10A, Associate Provost Patricia Hyer Papers</a>",,1996-03,,"This Item is protected by copyright and/or related rights. You are free to use this Item in any way that is permitted by the copyright and related rights legislation that applies to your use. In addition, no permission is required from the rights-holder(s) for educational uses. For other uses, you need to obtain permission from the rights-holder(s). <a href=""https://rightsstatements.org/page/InC-EDU/1.0/?language=en"" target=""_blank"" rel=""noreferrer noopener"">https://rightsstatements.org/page/InC-EDU/1.0/?language=en</a>.",,,English,,GenerationsWomenLeaders_1996,,,,,,,,,,,,,,,,,,,,,,,,,,,,,,,,,,,,,,,,"administrators,faculty",http://vtwomenshistory.lib.vt.edu/files/original/8350b9312a99c21e2921908fa44d74b7.pdf,Text,"Records of the Office of the Associate Provost, Patricia Hyer (RG 5/1/10a)",1,0
224,http://vtwomenshistory.lib.vt.edu/items/show/224,"<em>Minority Newsletter</em>, Fall Quarter, 1981","Alumni--Women^^Diversity in higher education^^Faculty--Women^^Staff--Women^^University policies","<em>Minority Newsletter</em> (continued by <em>Diversity News</em> LD5655 .A76831 D58)",,,,1981,,"This Item is protected by copyright and/or related rights. You are free to use this Item in any way that is permitted by the copyright and related rights legislation that applies to your use. In addition, no permission is required from the rights-holder(s) for educational uses. For other uses, you need to obtain permission from the rights-holder(s). <a href=""https://rightsstatements.org/page/InC-EDU/1.0/?language=en"" target=""_blank"" rel=""noreferrer noopener"">https://rightsstatements.org/page/InC-EDU/1.0/?language=en</a>",,application/pdf,English,Newsletters,LD_5655_A76831_M5_1981_Fall,,,,,,,,,,,,,,,,,,,,,,,,,,,,,,,,,,,,,,,,,http://digitalsc.lib.vt.edu/files/original/e7ef89c569b662055636c3a2ba1b6edd.pdf,Text,"<em>Minority Newsletter and Diversity News</em> (LD_5655_A76831)",1,0
225,http://vtwomenshistory.lib.vt.edu/items/show/225,"<em>Minority Newsletter</em>, Fall Quarter, 1982","Alumni--Women^^Diversity in higher education^^Faculty--Women^^Staff--Women^^University policies","<em>Minority Newsletter</em> (continued by <em>Diversity News</em> LD5655 .A76831 D58)",,,,1982,,"This Item is protected by copyright and/or related rights. You are free to use this Item in any way that is permitted by the copyright and related rights legislation that applies to your use. In addition, no permission is required from the rights-holder(s) for educational uses. For other uses, you need to obtain permission from the rights-holder(s). <a href=""https://rightsstatements.org/page/InC-EDU/1.0/?language=en"" target=""_blank"" rel=""noreferrer noopener"">https://rightsstatements.org/page/InC-EDU/1.0/?language=en</a>",,application/pdf,English,Newsletters,LD_5655_A76831_M5_1982_Fall,,,,,,,,,,,,,,,,,,,,,,,,,,,,,,,,,,,,,,,,,http://digitalsc.lib.vt.edu/files/original/5a361e3f1039a0281adf9dd8e5e85d62.pdf,Text,"<em>Minority Newsletter and Diversity News</em> (LD_5655_A76831)",1,0
226,http://vtwomenshistory.lib.vt.edu/items/show/226,"<em>Minority Newsletter</em>, Spring Quarter, 1982","Alumni--Women^^Diversity in higher education^^Faculty--Women^^Staff--Women^^University policies","<em>Minority Newsletter</em> (continued by <em>Diversity News</em> LD5655 .A76831 D58)",,,,1982,,"This Item is protected by copyright and/or related rights. You are free to use this Item in any way that is permitted by the copyright and related rights legislation that applies to your use. In addition, no permission is required from the rights-holder(s) for educational uses. For other uses, you need to obtain permission from the rights-holder(s). <a href=""https://rightsstatements.org/page/InC-EDU/1.0/?language=en"" target=""_blank"" rel=""noreferrer noopener"">https://rightsstatements.org/page/InC-EDU/1.0/?language=en</a>",,application/pdf,English,Newsletters,LD_5655_A76831_M5_1982_Spring,,,,,,,,,,,,,,,,,,,,,,,,,,,,,,,,,,,,,,,,,http://digitalsc.lib.vt.edu/files/original/a268e9c6fcb82d24757e885b97a10a9b.pdf,Text,"<em>Minority Newsletter and Diversity News</em> (LD_5655_A76831)",1,0
